Quantcast

Cache Exception

classic Classic list List threaded Threaded
5 messages Options
Reply | Threaded
Open this post in threaded view
|  
Report Content as Inappropriate

Cache Exception

hans_d
Administrator
I have run into the following exception today (on a windows box). I have
replace absolute paths as I'm at a client's side.

What should we with such an exception?

FAILURE: Build aborted because of an internal error.

* What went wrong:
Build aborted because of an unexpected internal error. Please file an
issue at: www.gradle.org.

* Try:
Run with -d option to get additional debug info.

* Exception is:
org.gradle.api.UncheckedIOException: Could not add entry
'<somePath>gradleout\classes\test' to cache
'<somePath>.gradle\0.9-20091126125859+0300\taskArtifacts\cache.bin'.
        at
        org.gradle.cache.BTreePersistentIndexedCache.put(BTreePersistentIndexedCache.java:140)
        [gradle-src/:na]
        at
        org.gradle.api.internal.changedetection.DefaultTaskArtifactStateRepository$1.update(DefaultTaskArtifactStateRepository.java:83)
        [gradle-src/:na]
        at
        org.gradle.api.internal.project.ExecutionShortCircuitTaskExecuter.execute(ExecutionShortCircuitTaskExecuter.java:65)
        [gradle-src/:na]
        at
        org.gradle.api.internal.tasks.SkipTaskExecuter.doExecute(SkipTaskExecuter.java:63)
        [gradle-src/:na]
        at
        org.gradle.api.internal.tasks.SkipTaskExecuter.execute(SkipTaskExecuter.java:36)
        [gradle-src/:na]
        at
        org.gradle.api.internal.AbstractTask.execute(AbstractTask.java:204)
        [gradle-src/:na]
        at
        org.gradle.execution.DefaultTaskGraphExecuter.executeTask(DefaultTaskGraphExecuter.java:167)
        [gradle-src/:na]
        at
        org.gradle.execution.DefaultTaskGraphExecuter.doExecute(DefaultTaskGraphExecuter.java:160)
        [gradle-src/:na]
        at
        org.gradle.execution.DefaultTaskGraphExecuter.execute(DefaultTaskGraphExecuter.java:78)
        [gradle-src/:na]
        at
        org.gradle.execution.TaskNameResolvingBuildExecuter.execute(TaskNameResolvingBuildExecuter.java:160)
        [gradle-src/:na]
        at
        org.gradle.execution.DelegatingBuildExecuter.execute(DelegatingBuildExecuter.java:54)
        [gradle-src/:na]
        at
        org.gradle.GradleLauncher.doBuildStages(GradleLauncher.java:193)
        [gradle-src/:na]
        at org.gradle.GradleLauncher.doBuild(GradleLauncher.java:128)
        [gradle-src/:na]
        at org.gradle.GradleLauncher.run(GradleLauncher.java:98)
        [gradle-src/:na]
        at org.gradle.launcher.Main.execute(Main.java:93)
        [gradle-src/:na]
        at org.gradle.launcher.Main.main(Main.java:42) [gradle-src/:na]
        at sun.reflect.NativeMethodAccessorImpl.invoke0(Native Method)
        [na:1.5.0_10]
        at
        sun.reflect.NativeMethodAccessorImpl.invoke(NativeMethodAccessorImpl.java:39)
        [na:1.5.0_10]
        at
        sun.reflect.DelegatingMethodAccessorImpl.invoke(DelegatingMethodAccessorImpl.java:25)
        [na:1.5.0_10]
        at java.lang.reflect.Method.invoke(Method.java:585)
        [na:1.5.0_10]
        at org.gradle.launcher.GradleMain.main(GradleMain.java:50)
        [gradle-src/:na]
        at sun.reflect.NativeMethodAccessorImpl.invoke0(Native Method)
        [na:1.5.0_10]
        at
        sun.reflect.NativeMethodAccessorImpl.invoke(NativeMethodAccessorImpl.java:39)
        [na:1.5.0_10]
        at
        sun.reflect.DelegatingMethodAccessorImpl.invoke(DelegatingMethodAccessorImpl.java:25)
        [na:1.5.0_10]
        at java.lang.reflect.Method.invoke(Method.java:585)
        [na:1.5.0_10]
        at
        com.intellij.rt.execution.application.AppMain.main(AppMain.java:105)
        [idea_rt.jar:na]
Caused by:
org.gradle.cache.BTreePersistentIndexedCache$CorruptedCacheException:
Corrupted IndexBlock 27518172 found in cache
'<somePath>\.gradle\0.9-20091126125859+0300\taskArtifacts\cache.bin'.
        at
        org.gradle.cache.BTreePersistentIndexedCache$Block.corruptedException(BTreePersistentIndexedCache.java:389)
        [gradle-src/:na]
        at
        org.gradle.cache.BTreePersistentIndexedCache$Block.read(BTreePersistentIndexedCache.java:365)
        [gradle-src/:na]
        at
        org.gradle.cache.BTreePersistentIndexedCache.load(BTreePersistentIndexedCache.java:207)
        [gradle-src/:na]
        at
        org.gradle.cache.BTreePersistentIndexedCache.access$1800(BTreePersistentIndexedCache.java:42)
        [gradle-src/:na]
        at
        org.gradle.cache.BTreePersistentIndexedCache$IndexRoot.getRoot(BTreePersistentIndexedCache.java:440)
        [gradle-src/:na]
        at
        org.gradle.cache.BTreePersistentIndexedCache$HeaderBlock.getFreeListRoot(BTreePersistentIndexedCache.java:493)
        [gradle-src/:na]
        at
        org.gradle.cache.BTreePersistentIndexedCache.alloc(BTreePersistentIndexedCache.java:177)
        [gradle-src/:na]
        at
        org.gradle.cache.BTreePersistentIndexedCache.access$900(BTreePersistentIndexedCache.java:42)
        [gradle-src/:na]
        at
        org.gradle.cache.BTreePersistentIndexedCache$Block.getPos(BTreePersistentIndexedCache.java:333)
        [gradle-src/:na]
        at
        org.gradle.cache.BTreePersistentIndexedCache$IndexBlock.add(BTreePersistentIndexedCache.java:598)
        [gradle-src/:na]
        at
        org.gradle.cache.BTreePersistentIndexedCache$IndexBlock.maybeSplit(BTreePersistentIndexedCache.java:586)
        [gradle-src/:na]
        at
        org.gradle.cache.BTreePersistentIndexedCache$IndexBlock.put(BTreePersistentIndexedCache.java:569)
        [gradle-src/:na]
        at
        org.gradle.cache.BTreePersistentIndexedCache.free(BTreePersistentIndexedCache.java:173)
        [gradle-src/:na]
        at
        org.gradle.cache.BTreePersistentIndexedCache.free(BTreePersistentIndexedCache.java:165)
        [gradle-src/:na]
        at
        org.gradle.cache.BTreePersistentIndexedCache.put(BTreePersistentIndexedCache.java:131)
        [gradle-src/:na]
        ... 25 common frames omitted

BUILD FAILED

Total time: 1 mins 54.865 secs

Hans

Process finished with exit code 1
--
  Hans Dockter
  [hidden email]


---------------------------------------------------------------------
To unsubscribe from this list, please visit:

    http://xircles.codehaus.org/manage_email


Reply | Threaded
Open this post in threaded view
|  
Report Content as Inappropriate

Re: Cache Exception

hans_d
Administrator
I could reproduce thie exception with another run. When I've tried to
regenerate the cache with -C rebuild I've run into the below exception.
I could easily delete this file with the Windows Explorer. This looks
like a specific windows issue.

- Hans

FAILURE: Build failed with an exception.

* Where:
Build file '<somePath>build.gradle' line: 20

* What went wrong:
A problem occurred evaluating root project 'mrg'.
Cause: Could not create task of type 'Clean'.

* Try:
Run with -S option to get the full (very verbose) stacktrace.

* Exception is:
org.gradle.api.GradleScriptException: Build file
'<somePath>build.gradle' line: 20
A problem occurred evaluating root project 'mrg'.
        at
        org.gradle.groovy.scripts.DefaultScriptRunnerFactory$ScriptRunnerImpl.run(DefaultScriptRunnerFactory.java:55)
        [gradle-src/:na]
        at
        org.gradle.configuration.BuildScriptProcessor.evaluate(BuildScriptProcessor.java:51)
        [gradle-src/:na]
        at
        org.gradle.configuration.DefaultProjectEvaluator.evaluate(DefaultProjectEvaluator.java:35)
        [gradle-src/:na]
        at
        org.gradle.api.internal.project.AbstractProject.evaluate(AbstractProject.java:534)
        [gradle-src/:na]
        at
        org.gradle.api.internal.project.AbstractProject.evaluate(AbstractProject.java:62)
        [gradle-src/:na]
        at
        org.gradle.api.internal.project.ProjectInternal$evaluate.call(Unknown
        Source) [na:na]
        at
        org.gradle.configuration.BuildConfigurer$_closure1.doCall(BuildConfigurer.groovy:41)
        [gradle-src/:na]
        at $Proxy1.execute(Unknown Source) [na:na]
        at
        org.gradle.api.internal.project.AbstractProject.applyActions(AbstractProject.java:504)
        [gradle-src/:na]
        at
        org.gradle.api.internal.project.AbstractProject.allprojects(AbstractProject.java:499)
        [gradle-src/:na]
        at org.gradle.api.Project$allprojects.call(Unknown Source)
        [na:na]
        at
        org.gradle.configuration.BuildConfigurer.process(BuildConfigurer.groovy:48)
        [gradle-src/:na]
        at
        org.gradle.GradleLauncher.doBuildStages(GradleLauncher.java:176)
        [gradle-src/:na]
        at org.gradle.GradleLauncher.doBuild(GradleLauncher.java:128)
        [gradle-src/:na]
        at org.gradle.GradleLauncher.run(GradleLauncher.java:98)
        [gradle-src/:na]
        at org.gradle.launcher.Main.execute(Main.java:93)
        [gradle-src/:na]
        at org.gradle.launcher.Main.main(Main.java:42) [gradle-src/:na]
        at org.gradle.launcher.GradleMain.main(GradleMain.java:50)
        [gradle-src/:na]
        at
        com.intellij.rt.execution.application.AppMain.main(AppMain.java:105)
        [na:na]
Caused by: org.gradle.api.GradleException: Could not create task of type
'Clean'.
        at
        org.gradle.api.internal.project.TaskFactory$1.call(TaskFactory.java:106)
        [gradle-src/:na]
        at
        org.gradle.api.internal.project.TaskFactory$1.call(TaskFactory.java:102)
        [gradle-src/:na]
        at
        org.gradle.api.internal.AbstractTask.injectIntoNewInstance(AbstractTask.java:107)
        [gradle-src/:na]
        at
        org.gradle.api.internal.project.TaskFactory.createTaskObject(TaskFactory.java:101)
        [gradle-src/:na]
        at
        org.gradle.api.internal.project.TaskFactory.createTask(TaskFactory.java:53)
        [gradle-src/:na]
        at
        org.gradle.api.internal.project.AnnotationProcessingTaskFactory.createTask(AnnotationProcessingTaskFactory.java:61)
        [gradle-src/:na]
        at
        org.gradle.api.internal.project.DependencyAutoWireTaskFactory.createTask(DependencyAutoWireTaskFactory.java:38)
        [gradle-src/:na]
        at
        org.gradle.api.internal.tasks.DefaultTaskContainer.add(DefaultTaskContainer.java:45)
        [gradle-src/:na]
        at
        org.gradle.api.internal.tasks.DefaultTaskContainer.add(DefaultTaskContainer.java:63)
        [gradle-src/:na]
        at
        org.gradle.api.plugins.BasePlugin.addClean(BasePlugin.groovy:65)
        [gradle-src/:na]
        at
        org.gradle.api.plugins.BasePlugin.this$2$addClean(BasePlugin.groovy)
        [gradle-src/:na]
        at
        org.gradle.api.plugins.BasePlugin$this$2$addClean.callCurrent(Unknown
        Source) [na:na]
        at org.gradle.api.plugins.BasePlugin.use(BasePlugin.groovy:42)
        [gradle-src/:na]
        at
        org.gradle.api.internal.plugins.DefaultProjectsPluginContainer$1.providePlugin(DefaultProjectsPluginContainer.java:69)
        [gradle-src/:na]
        at
        org.gradle.api.internal.plugins.AbstractPluginContainer.addPluginInternal(AbstractPluginContainer.java:39)
        [gradle-src/:na]
        at
        org.gradle.api.internal.plugins.AbstractPluginContainer.addPlugin(AbstractPluginContainer.java:34)
        [gradle-src/:na]
        at
        org.gradle.api.internal.plugins.DefaultProjectsPluginContainer.usePlugin(DefaultProjectsPluginContainer.java:38)
        [gradle-src/:na]
        at org.gradle.api.plugins.JavaPlugin.use(JavaPlugin.java:68)
        [gradle-src/:na]
        at
        org.gradle.api.internal.plugins.DefaultProjectsPluginContainer$1.providePlugin(DefaultProjectsPluginContainer.java:69)
        [gradle-src/:na]
        at
        org.gradle.api.internal.plugins.AbstractPluginContainer.addPluginInternal(AbstractPluginContainer.java:39)
        [gradle-src/:na]
        at
        org.gradle.api.internal.plugins.AbstractPluginContainer.addPlugin(AbstractPluginContainer.java:30)
        [gradle-src/:na]
        at
        org.gradle.api.internal.plugins.DefaultProjectsPluginContainer.usePlugin(DefaultProjectsPluginContainer.java:34)
        [gradle-src/:na]
        at
        org.gradle.api.internal.project.AbstractProject.usePlugin(AbstractProject.java:543)
        [gradle-src/:na]
        at
        build_gradle_2b4d71efaa05a63c7aeace4be99952e9$_run_closure4.doCall(<somepath>\build.gradle:20)
        [na:na]
        at
        build_gradle_2b4d71efaa05a63c7aeace4be99952e9$_run_closure4.doCall(\mrg\build.gradle)
        [na:na]
        at
        org.gradle.util.ConfigureUtil.configure(ConfigureUtil.java:42)
        [gradle-src/:na]
        at
        org.gradle.util.ConfigureUtil.configure(ConfigureUtil.java:33)
        [gradle-src/:na]
        at org.gradle.util.ConfigureUtil$configure.call(Unknown Source)
        [na:na]
        at org.gradle.util.ConfigureUtil$configure.call(Unknown Source)
        [na:na]
        at
        org.gradle.api.internal.project.DefaultProject$_configure_closure1.doCall(DefaultProject.groovy:80)
        [gradle-src/:na]
        at
        org.gradle.api.internal.project.DefaultProject.configure(DefaultProject.groovy:79)
        [gradle-src/:na]
        at org.gradle.api.Project$configure.callCurrent(Unknown Source)
        [na:na]
        at
        org.gradle.api.internal.project.DefaultProject.subprojects(DefaultProject.groovy:63)
        [gradle-src/:na]
        at
        org.gradle.api.internal.project.DefaultProject.invokeMethod(DefaultProject.groovy)
        [gradle-src/:na]
        at
        org.gradle.groovy.scripts.DefaultScriptMetaData$_applyMetaData_closure1.doCall(DefaultScriptMetaData.groovy:31)
        [gradle-src/:na]
        at
        build_gradle_2b4d71efaa05a63c7aeace4be99952e9.run(<somePath>/build.gradle:18)
        [na:na]
        at
        org.gradle.groovy.scripts.DefaultScriptRunnerFactory$ScriptRunnerImpl.run(DefaultScriptRunnerFactory.java:53)
        [gradle-src/:na]
        ... 18 common frames omitted
Caused by: org.gradle.api.UncheckedIOException: java.io.IOException:
Unable to delete file:
<somePath>\.gradle\caches\0.9-20091126125859+0300\fileHashes\cache.bin
        at
        org.gradle.util.GFileUtils.deleteDirectory(GFileUtils.java:204)
        [gradle-src/:na]
        at
        org.gradle.cache.DefaultPersistentCache.buildCacheDir(DefaultPersistentCache.java:42)
        [gradle-src/:na]
        at
        org.gradle.cache.DefaultPersistentCache.<init>(DefaultPersistentCache.java:37)
        [gradle-src/:na]
        at
        org.gradle.cache.DefaultCacheRepository.getGlobalCache(DefaultCacheRepository.java:53)
        [gradle-src/:na]
        at
        org.gradle.cache.DefaultCacheRepository.getIndexedGlobalCache(DefaultCacheRepository.java:62)
        [gradle-src/:na]
        at
        org.gradle.api.internal.changedetection.CachingHasher.<init>(CachingHasher.java:32)
        [gradle-src/:na]
        at
        org.gradle.api.internal.project.DefaultServiceRegistryFactory$15.create(DefaultServiceRegistryFactory.java:222)
        [gradle-src/:na]
        at
        org.gradle.api.internal.project.AbstractServiceRegistry$Service.getService(AbstractServiceRegistry.java:75)
        [gradle-src/:na]
        at
        org.gradle.api.internal.project.AbstractServiceRegistry.get(AbstractServiceRegistry.java:48)
        [gradle-src/:na]
        at
        org.gradle.api.internal.project.DefaultServiceRegistryFactory$1.create(DefaultServiceRegistryFactory.java:74)
        [gradle-src/:na]
        at
        org.gradle.api.internal.project.AbstractServiceRegistry$Service.getService(AbstractServiceRegistry.java:75)
        [gradle-src/:na]
        at
        org.gradle.api.internal.project.AbstractServiceRegistry.get(AbstractServiceRegistry.java:48)
        [gradle-src/:na]
        at
        org.gradle.api.internal.project.AbstractServiceRegistry.get(AbstractServiceRegistry.java:55)
        [gradle-src/:na]
        at
        org.gradle.api.internal.project.AbstractServiceRegistry.get(AbstractServiceRegistry.java:55)
        [gradle-src/:na]
        at
        org.gradle.api.internal.project.AbstractServiceRegistry.get(AbstractServiceRegistry.java:55)
        [gradle-src/:na]
        at
        org.gradle.api.internal.AbstractTask.<init>(AbstractTask.java:100)
        [gradle-src/:na]
        at
        org.gradle.api.internal.AbstractTask.<init>(AbstractTask.java:80)
        [gradle-src/:na]
        at org.gradle.api.DefaultTask.<init>(DefaultTask.groovy:28)
        [gradle-src/:na]
        at
        org.gradle.api.internal.ConventionTask.<init>(ConventionTask.java:29)
        [gradle-src/:na]
        at org.gradle.api.tasks.Clean.<init>(Clean.java:31)
        [gradle-src/:na]
        at org.gradle.api.tasks.Clean_Decorated.<init>(Unknown Source)
        [na:na]
        at
        org.gradle.api.internal.project.TaskFactory$1.call(TaskFactory.java:104)
        [gradle-src/:na]
        ... 54 common frames omitted
Caused by: java.io.IOException: Unable to delete file:
<somePath>/.gradle\caches\0.9-20091126125859+0300\fileHashes\cache.bin
        at
        org.apache.commons.io.FileUtils.forceDelete(FileUtils.java:1390)
        [commons-io-1.4.jar:1.4]
        at
        org.apache.commons.io.FileUtils.cleanDirectory(FileUtils.java:1044)
        [commons-io-1.4.jar:1.4]
        at
        org.apache.commons.io.FileUtils.deleteDirectory(FileUtils.java:977)
        [commons-io-1.4.jar:1.4]
        at
        org.gradle.util.GFileUtils.deleteDirectory(GFileUtils.java:202)
        [gradle-src/:na]
        ... 75 common frames omitted
Total time: 10.511 secs

BUILD FAILED


On Tue, 01 Dec 2009 08:07 -0800, "Hans Dockter" <[hidden email]>
wrote:

> I have run into the following exception today (on a windows box). I have
> replace absolute paths as I'm at a client's side.
>
> What should we with such an exception?
>
> FAILURE: Build aborted because of an internal error.
>
> * What went wrong:
> Build aborted because of an unexpected internal error. Please file an
> issue at: www.gradle.org.
>
> * Try:
> Run with -d option to get additional debug info.
>
> * Exception is:
> org.gradle.api.UncheckedIOException: Could not add entry
> '<somePath>gradleout\classes\test' to cache
> '<somePath>.gradle\0.9-20091126125859+0300\taskArtifacts\cache.bin'.
> at
> org.gradle.cache.BTreePersistentIndexedCache.put(BTreePersistentIndexedCache.java:140)
> [gradle-src/:na]
> at
> org.gradle.api.internal.changedetection.DefaultTaskArtifactStateRepository$1.update(DefaultTaskArtifactStateRepository.java:83)
> [gradle-src/:na]
> at
> org.gradle.api.internal.project.ExecutionShortCircuitTaskExecuter.execute(ExecutionShortCircuitTaskExecuter.java:65)
> [gradle-src/:na]
> at
> org.gradle.api.internal.tasks.SkipTaskExecuter.doExecute(SkipTaskExecuter.java:63)
> [gradle-src/:na]
> at
> org.gradle.api.internal.tasks.SkipTaskExecuter.execute(SkipTaskExecuter.java:36)
> [gradle-src/:na]
> at
> org.gradle.api.internal.AbstractTask.execute(AbstractTask.java:204)
> [gradle-src/:na]
> at
> org.gradle.execution.DefaultTaskGraphExecuter.executeTask(DefaultTaskGraphExecuter.java:167)
> [gradle-src/:na]
> at
> org.gradle.execution.DefaultTaskGraphExecuter.doExecute(DefaultTaskGraphExecuter.java:160)
> [gradle-src/:na]
> at
> org.gradle.execution.DefaultTaskGraphExecuter.execute(DefaultTaskGraphExecuter.java:78)
> [gradle-src/:na]
> at
> org.gradle.execution.TaskNameResolvingBuildExecuter.execute(TaskNameResolvingBuildExecuter.java:160)
> [gradle-src/:na]
> at
> org.gradle.execution.DelegatingBuildExecuter.execute(DelegatingBuildExecuter.java:54)
> [gradle-src/:na]
> at
> org.gradle.GradleLauncher.doBuildStages(GradleLauncher.java:193)
> [gradle-src/:na]
> at org.gradle.GradleLauncher.doBuild(GradleLauncher.java:128)
> [gradle-src/:na]
> at org.gradle.GradleLauncher.run(GradleLauncher.java:98)
> [gradle-src/:na]
> at org.gradle.launcher.Main.execute(Main.java:93)
> [gradle-src/:na]
> at org.gradle.launcher.Main.main(Main.java:42) [gradle-src/:na]
> at sun.reflect.NativeMethodAccessorImpl.invoke0(Native Method)
> [na:1.5.0_10]
> at
> sun.reflect.NativeMethodAccessorImpl.invoke(NativeMethodAccessorImpl.java:39)
> [na:1.5.0_10]
> at
> sun.reflect.DelegatingMethodAccessorImpl.invoke(DelegatingMethodAccessorImpl.java:25)
> [na:1.5.0_10]
> at java.lang.reflect.Method.invoke(Method.java:585)
> [na:1.5.0_10]
> at org.gradle.launcher.GradleMain.main(GradleMain.java:50)
> [gradle-src/:na]
> at sun.reflect.NativeMethodAccessorImpl.invoke0(Native Method)
> [na:1.5.0_10]
> at
> sun.reflect.NativeMethodAccessorImpl.invoke(NativeMethodAccessorImpl.java:39)
> [na:1.5.0_10]
> at
> sun.reflect.DelegatingMethodAccessorImpl.invoke(DelegatingMethodAccessorImpl.java:25)
> [na:1.5.0_10]
> at java.lang.reflect.Method.invoke(Method.java:585)
> [na:1.5.0_10]
> at
> com.intellij.rt.execution.application.AppMain.main(AppMain.java:105)
> [idea_rt.jar:na]
> Caused by:
> org.gradle.cache.BTreePersistentIndexedCache$CorruptedCacheException:
> Corrupted IndexBlock 27518172 found in cache
> '<somePath>\.gradle\0.9-20091126125859+0300\taskArtifacts\cache.bin'.
> at
> org.gradle.cache.BTreePersistentIndexedCache$Block.corruptedException(BTreePersistentIndexedCache.java:389)
> [gradle-src/:na]
> at
> org.gradle.cache.BTreePersistentIndexedCache$Block.read(BTreePersistentIndexedCache.java:365)
> [gradle-src/:na]
> at
> org.gradle.cache.BTreePersistentIndexedCache.load(BTreePersistentIndexedCache.java:207)
> [gradle-src/:na]
> at
> org.gradle.cache.BTreePersistentIndexedCache.access$1800(BTreePersistentIndexedCache.java:42)
> [gradle-src/:na]
> at
> org.gradle.cache.BTreePersistentIndexedCache$IndexRoot.getRoot(BTreePersistentIndexedCache.java:440)
> [gradle-src/:na]
> at
> org.gradle.cache.BTreePersistentIndexedCache$HeaderBlock.getFreeListRoot(BTreePersistentIndexedCache.java:493)
> [gradle-src/:na]
> at
> org.gradle.cache.BTreePersistentIndexedCache.alloc(BTreePersistentIndexedCache.java:177)
> [gradle-src/:na]
> at
> org.gradle.cache.BTreePersistentIndexedCache.access$900(BTreePersistentIndexedCache.java:42)
> [gradle-src/:na]
> at
> org.gradle.cache.BTreePersistentIndexedCache$Block.getPos(BTreePersistentIndexedCache.java:333)
> [gradle-src/:na]
> at
> org.gradle.cache.BTreePersistentIndexedCache$IndexBlock.add(BTreePersistentIndexedCache.java:598)
> [gradle-src/:na]
> at
> org.gradle.cache.BTreePersistentIndexedCache$IndexBlock.maybeSplit(BTreePersistentIndexedCache.java:586)
> [gradle-src/:na]
> at
> org.gradle.cache.BTreePersistentIndexedCache$IndexBlock.put(BTreePersistentIndexedCache.java:569)
> [gradle-src/:na]
> at
> org.gradle.cache.BTreePersistentIndexedCache.free(BTreePersistentIndexedCache.java:173)
> [gradle-src/:na]
> at
> org.gradle.cache.BTreePersistentIndexedCache.free(BTreePersistentIndexedCache.java:165)
> [gradle-src/:na]
> at
> org.gradle.cache.BTreePersistentIndexedCache.put(BTreePersistentIndexedCache.java:131)
> [gradle-src/:na]
> ... 25 common frames omitted
>
> BUILD FAILED
>
> Total time: 1 mins 54.865 secs
>
> Hans
>
> Process finished with exit code 1
> --
>   Hans Dockter
>   [hidden email]
>
>
> ---------------------------------------------------------------------
> To unsubscribe from this list, please visit:
>
>     http://xircles.codehaus.org/manage_email
>
>

---------------------------------------------------------------------
To unsubscribe from this list, please visit:

    http://xircles.codehaus.org/manage_email


Reply | Threaded
Open this post in threaded view
|  
Report Content as Inappropriate

Re: Cache Exception

hans_d
Administrator
In reply to this post by hans_d
This exception seems to happen for task like processResources and
processTestResources when the input is empty.

- Hans

On Tue, 01 Dec 2009 08:07 -0800, "Hans Dockter" <[hidden email]>
wrote:

> I have run into the following exception today (on a windows box). I have
> replace absolute paths as I'm at a client's side.
>
> What should we with such an exception?
>
> FAILURE: Build aborted because of an internal error.
>
> * What went wrong:
> Build aborted because of an unexpected internal error. Please file an
> issue at: www.gradle.org.
>
> * Try:
> Run with -d option to get additional debug info.
>
> * Exception is:
> org.gradle.api.UncheckedIOException: Could not add entry
> '<somePath>gradleout\classes\test' to cache
> '<somePath>.gradle\0.9-20091126125859+0300\taskArtifacts\cache.bin'.
> at
> org.gradle.cache.BTreePersistentIndexedCache.put(BTreePersistentIndexedCache.java:140)
> [gradle-src/:na]
> at
> org.gradle.api.internal.changedetection.DefaultTaskArtifactStateRepository$1.update(DefaultTaskArtifactStateRepository.java:83)
> [gradle-src/:na]
> at
> org.gradle.api.internal.project.ExecutionShortCircuitTaskExecuter.execute(ExecutionShortCircuitTaskExecuter.java:65)
> [gradle-src/:na]
> at
> org.gradle.api.internal.tasks.SkipTaskExecuter.doExecute(SkipTaskExecuter.java:63)
> [gradle-src/:na]
> at
> org.gradle.api.internal.tasks.SkipTaskExecuter.execute(SkipTaskExecuter.java:36)
> [gradle-src/:na]
> at
> org.gradle.api.internal.AbstractTask.execute(AbstractTask.java:204)
> [gradle-src/:na]
> at
> org.gradle.execution.DefaultTaskGraphExecuter.executeTask(DefaultTaskGraphExecuter.java:167)
> [gradle-src/:na]
> at
> org.gradle.execution.DefaultTaskGraphExecuter.doExecute(DefaultTaskGraphExecuter.java:160)
> [gradle-src/:na]
> at
> org.gradle.execution.DefaultTaskGraphExecuter.execute(DefaultTaskGraphExecuter.java:78)
> [gradle-src/:na]
> at
> org.gradle.execution.TaskNameResolvingBuildExecuter.execute(TaskNameResolvingBuildExecuter.java:160)
> [gradle-src/:na]
> at
> org.gradle.execution.DelegatingBuildExecuter.execute(DelegatingBuildExecuter.java:54)
> [gradle-src/:na]
> at
> org.gradle.GradleLauncher.doBuildStages(GradleLauncher.java:193)
> [gradle-src/:na]
> at org.gradle.GradleLauncher.doBuild(GradleLauncher.java:128)
> [gradle-src/:na]
> at org.gradle.GradleLauncher.run(GradleLauncher.java:98)
> [gradle-src/:na]
> at org.gradle.launcher.Main.execute(Main.java:93)
> [gradle-src/:na]
> at org.gradle.launcher.Main.main(Main.java:42) [gradle-src/:na]
> at sun.reflect.NativeMethodAccessorImpl.invoke0(Native Method)
> [na:1.5.0_10]
> at
> sun.reflect.NativeMethodAccessorImpl.invoke(NativeMethodAccessorImpl.java:39)
> [na:1.5.0_10]
> at
> sun.reflect.DelegatingMethodAccessorImpl.invoke(DelegatingMethodAccessorImpl.java:25)
> [na:1.5.0_10]
> at java.lang.reflect.Method.invoke(Method.java:585)
> [na:1.5.0_10]
> at org.gradle.launcher.GradleMain.main(GradleMain.java:50)
> [gradle-src/:na]
> at sun.reflect.NativeMethodAccessorImpl.invoke0(Native Method)
> [na:1.5.0_10]
> at
> sun.reflect.NativeMethodAccessorImpl.invoke(NativeMethodAccessorImpl.java:39)
> [na:1.5.0_10]
> at
> sun.reflect.DelegatingMethodAccessorImpl.invoke(DelegatingMethodAccessorImpl.java:25)
> [na:1.5.0_10]
> at java.lang.reflect.Method.invoke(Method.java:585)
> [na:1.5.0_10]
> at
> com.intellij.rt.execution.application.AppMain.main(AppMain.java:105)
> [idea_rt.jar:na]
> Caused by:
> org.gradle.cache.BTreePersistentIndexedCache$CorruptedCacheException:
> Corrupted IndexBlock 27518172 found in cache
> '<somePath>\.gradle\0.9-20091126125859+0300\taskArtifacts\cache.bin'.
> at
> org.gradle.cache.BTreePersistentIndexedCache$Block.corruptedException(BTreePersistentIndexedCache.java:389)
> [gradle-src/:na]
> at
> org.gradle.cache.BTreePersistentIndexedCache$Block.read(BTreePersistentIndexedCache.java:365)
> [gradle-src/:na]
> at
> org.gradle.cache.BTreePersistentIndexedCache.load(BTreePersistentIndexedCache.java:207)
> [gradle-src/:na]
> at
> org.gradle.cache.BTreePersistentIndexedCache.access$1800(BTreePersistentIndexedCache.java:42)
> [gradle-src/:na]
> at
> org.gradle.cache.BTreePersistentIndexedCache$IndexRoot.getRoot(BTreePersistentIndexedCache.java:440)
> [gradle-src/:na]
> at
> org.gradle.cache.BTreePersistentIndexedCache$HeaderBlock.getFreeListRoot(BTreePersistentIndexedCache.java:493)
> [gradle-src/:na]
> at
> org.gradle.cache.BTreePersistentIndexedCache.alloc(BTreePersistentIndexedCache.java:177)
> [gradle-src/:na]
> at
> org.gradle.cache.BTreePersistentIndexedCache.access$900(BTreePersistentIndexedCache.java:42)
> [gradle-src/:na]
> at
> org.gradle.cache.BTreePersistentIndexedCache$Block.getPos(BTreePersistentIndexedCache.java:333)
> [gradle-src/:na]
> at
> org.gradle.cache.BTreePersistentIndexedCache$IndexBlock.add(BTreePersistentIndexedCache.java:598)
> [gradle-src/:na]
> at
> org.gradle.cache.BTreePersistentIndexedCache$IndexBlock.maybeSplit(BTreePersistentIndexedCache.java:586)
> [gradle-src/:na]
> at
> org.gradle.cache.BTreePersistentIndexedCache$IndexBlock.put(BTreePersistentIndexedCache.java:569)
> [gradle-src/:na]
> at
> org.gradle.cache.BTreePersistentIndexedCache.free(BTreePersistentIndexedCache.java:173)
> [gradle-src/:na]
> at
> org.gradle.cache.BTreePersistentIndexedCache.free(BTreePersistentIndexedCache.java:165)
> [gradle-src/:na]
> at
> org.gradle.cache.BTreePersistentIndexedCache.put(BTreePersistentIndexedCache.java:131)
> [gradle-src/:na]
> ... 25 common frames omitted
>
> BUILD FAILED
>
> Total time: 1 mins 54.865 secs
>
> Hans
>
> Process finished with exit code 1
> --
>   Hans Dockter
>   [hidden email]
>
>
> ---------------------------------------------------------------------
> To unsubscribe from this list, please visit:
>
>     http://xircles.codehaus.org/manage_email
>
>

---------------------------------------------------------------------
To unsubscribe from this list, please visit:

    http://xircles.codehaus.org/manage_email


Reply | Threaded
Open this post in threaded view
|  
Report Content as Inappropriate

Re: Cache Exception

hans_d
Administrator


On Tue, 01 Dec 2009 10:51 -0800, [hidden email] wrote:
> This exception seems to happen for task like processResources and
> processTestResources when the input is empty.

I should add that this happens not necessarily. But if it happenes (and
in the current build I'm working on it always happens at some point) it
is during the up to date check for this category of tasks. If I exclude
empty input tasks everything works.

- Hans

>
> - Hans
>
> On Tue, 01 Dec 2009 08:07 -0800, "Hans Dockter" <[hidden email]>
> wrote:
> > I have run into the following exception today (on a windows box). I have
> > replace absolute paths as I'm at a client's side.
> >
> > What should we with such an exception?
> >
> > FAILURE: Build aborted because of an internal error.
> >
> > * What went wrong:
> > Build aborted because of an unexpected internal error. Please file an
> > issue at: www.gradle.org.
> >
> > * Try:
> > Run with -d option to get additional debug info.
> >
> > * Exception is:
> > org.gradle.api.UncheckedIOException: Could not add entry
> > '<somePath>gradleout\classes\test' to cache
> > '<somePath>.gradle\0.9-20091126125859+0300\taskArtifacts\cache.bin'.
> > at
> > org.gradle.cache.BTreePersistentIndexedCache.put(BTreePersistentIndexedCache.java:140)
> > [gradle-src/:na]
> > at
> > org.gradle.api.internal.changedetection.DefaultTaskArtifactStateRepository$1.update(DefaultTaskArtifactStateRepository.java:83)
> > [gradle-src/:na]
> > at
> > org.gradle.api.internal.project.ExecutionShortCircuitTaskExecuter.execute(ExecutionShortCircuitTaskExecuter.java:65)
> > [gradle-src/:na]
> > at
> > org.gradle.api.internal.tasks.SkipTaskExecuter.doExecute(SkipTaskExecuter.java:63)
> > [gradle-src/:na]
> > at
> > org.gradle.api.internal.tasks.SkipTaskExecuter.execute(SkipTaskExecuter.java:36)
> > [gradle-src/:na]
> > at
> > org.gradle.api.internal.AbstractTask.execute(AbstractTask.java:204)
> > [gradle-src/:na]
> > at
> > org.gradle.execution.DefaultTaskGraphExecuter.executeTask(DefaultTaskGraphExecuter.java:167)
> > [gradle-src/:na]
> > at
> > org.gradle.execution.DefaultTaskGraphExecuter.doExecute(DefaultTaskGraphExecuter.java:160)
> > [gradle-src/:na]
> > at
> > org.gradle.execution.DefaultTaskGraphExecuter.execute(DefaultTaskGraphExecuter.java:78)
> > [gradle-src/:na]
> > at
> > org.gradle.execution.TaskNameResolvingBuildExecuter.execute(TaskNameResolvingBuildExecuter.java:160)
> > [gradle-src/:na]
> > at
> > org.gradle.execution.DelegatingBuildExecuter.execute(DelegatingBuildExecuter.java:54)
> > [gradle-src/:na]
> > at
> > org.gradle.GradleLauncher.doBuildStages(GradleLauncher.java:193)
> > [gradle-src/:na]
> > at org.gradle.GradleLauncher.doBuild(GradleLauncher.java:128)
> > [gradle-src/:na]
> > at org.gradle.GradleLauncher.run(GradleLauncher.java:98)
> > [gradle-src/:na]
> > at org.gradle.launcher.Main.execute(Main.java:93)
> > [gradle-src/:na]
> > at org.gradle.launcher.Main.main(Main.java:42) [gradle-src/:na]
> > at sun.reflect.NativeMethodAccessorImpl.invoke0(Native Method)
> > [na:1.5.0_10]
> > at
> > sun.reflect.NativeMethodAccessorImpl.invoke(NativeMethodAccessorImpl.java:39)
> > [na:1.5.0_10]
> > at
> > sun.reflect.DelegatingMethodAccessorImpl.invoke(DelegatingMethodAccessorImpl.java:25)
> > [na:1.5.0_10]
> > at java.lang.reflect.Method.invoke(Method.java:585)
> > [na:1.5.0_10]
> > at org.gradle.launcher.GradleMain.main(GradleMain.java:50)
> > [gradle-src/:na]
> > at sun.reflect.NativeMethodAccessorImpl.invoke0(Native Method)
> > [na:1.5.0_10]
> > at
> > sun.reflect.NativeMethodAccessorImpl.invoke(NativeMethodAccessorImpl.java:39)
> > [na:1.5.0_10]
> > at
> > sun.reflect.DelegatingMethodAccessorImpl.invoke(DelegatingMethodAccessorImpl.java:25)
> > [na:1.5.0_10]
> > at java.lang.reflect.Method.invoke(Method.java:585)
> > [na:1.5.0_10]
> > at
> > com.intellij.rt.execution.application.AppMain.main(AppMain.java:105)
> > [idea_rt.jar:na]
> > Caused by:
> > org.gradle.cache.BTreePersistentIndexedCache$CorruptedCacheException:
> > Corrupted IndexBlock 27518172 found in cache
> > '<somePath>\.gradle\0.9-20091126125859+0300\taskArtifacts\cache.bin'.
> > at
> > org.gradle.cache.BTreePersistentIndexedCache$Block.corruptedException(BTreePersistentIndexedCache.java:389)
> > [gradle-src/:na]
> > at
> > org.gradle.cache.BTreePersistentIndexedCache$Block.read(BTreePersistentIndexedCache.java:365)
> > [gradle-src/:na]
> > at
> > org.gradle.cache.BTreePersistentIndexedCache.load(BTreePersistentIndexedCache.java:207)
> > [gradle-src/:na]
> > at
> > org.gradle.cache.BTreePersistentIndexedCache.access$1800(BTreePersistentIndexedCache.java:42)
> > [gradle-src/:na]
> > at
> > org.gradle.cache.BTreePersistentIndexedCache$IndexRoot.getRoot(BTreePersistentIndexedCache.java:440)
> > [gradle-src/:na]
> > at
> > org.gradle.cache.BTreePersistentIndexedCache$HeaderBlock.getFreeListRoot(BTreePersistentIndexedCache.java:493)
> > [gradle-src/:na]
> > at
> > org.gradle.cache.BTreePersistentIndexedCache.alloc(BTreePersistentIndexedCache.java:177)
> > [gradle-src/:na]
> > at
> > org.gradle.cache.BTreePersistentIndexedCache.access$900(BTreePersistentIndexedCache.java:42)
> > [gradle-src/:na]
> > at
> > org.gradle.cache.BTreePersistentIndexedCache$Block.getPos(BTreePersistentIndexedCache.java:333)
> > [gradle-src/:na]
> > at
> > org.gradle.cache.BTreePersistentIndexedCache$IndexBlock.add(BTreePersistentIndexedCache.java:598)
> > [gradle-src/:na]
> > at
> > org.gradle.cache.BTreePersistentIndexedCache$IndexBlock.maybeSplit(BTreePersistentIndexedCache.java:586)
> > [gradle-src/:na]
> > at
> > org.gradle.cache.BTreePersistentIndexedCache$IndexBlock.put(BTreePersistentIndexedCache.java:569)
> > [gradle-src/:na]
> > at
> > org.gradle.cache.BTreePersistentIndexedCache.free(BTreePersistentIndexedCache.java:173)
> > [gradle-src/:na]
> > at
> > org.gradle.cache.BTreePersistentIndexedCache.free(BTreePersistentIndexedCache.java:165)
> > [gradle-src/:na]
> > at
> > org.gradle.cache.BTreePersistentIndexedCache.put(BTreePersistentIndexedCache.java:131)
> > [gradle-src/:na]
> > ... 25 common frames omitted
> >
> > BUILD FAILED
> >
> > Total time: 1 mins 54.865 secs
> >
> > Hans
> >
> > Process finished with exit code 1
> > --
> >   Hans Dockter
> >   [hidden email]
> >
> >
> > ---------------------------------------------------------------------
> > To unsubscribe from this list, please visit:
> >
> >     http://xircles.codehaus.org/manage_email
> >
> >
>
> ---------------------------------------------------------------------
> To unsubscribe from this list, please visit:
>
>     http://xircles.codehaus.org/manage_email
>
>

---------------------------------------------------------------------
To unsubscribe from this list, please visit:

    http://xircles.codehaus.org/manage_email


Reply | Threaded
Open this post in threaded view
|  
Report Content as Inappropriate

Re: Cache Exception

Adam Murdoch-2
In reply to this post by hans_d
I'll add some trace in, so we can see what's going on.

Hans Dockter wrote:

> I have run into the following exception today (on a windows box). I have
> replace absolute paths as I'm at a client's side.
>
> What should we with such an exception?
>
> FAILURE: Build aborted because of an internal error.
>
> * What went wrong:
> Build aborted because of an unexpected internal error. Please file an
> issue at: www.gradle.org.
>
> * Try:
> Run with -d option to get additional debug info.
>
> * Exception is:
> org.gradle.api.UncheckedIOException: Could not add entry
> '<somePath>gradleout\classes\test' to cache
> '<somePath>.gradle\0.9-20091126125859+0300\taskArtifacts\cache.bin'.
> at
> org.gradle.cache.BTreePersistentIndexedCache.put(BTreePersistentIndexedCache.java:140)
> [gradle-src/:na]
> at
> org.gradle.api.internal.changedetection.DefaultTaskArtifactStateRepository$1.update(DefaultTaskArtifactStateRepository.java:83)
> [gradle-src/:na]
> at
> org.gradle.api.internal.project.ExecutionShortCircuitTaskExecuter.execute(ExecutionShortCircuitTaskExecuter.java:65)
> [gradle-src/:na]
> at
> org.gradle.api.internal.tasks.SkipTaskExecuter.doExecute(SkipTaskExecuter.java:63)
> [gradle-src/:na]
> at
> org.gradle.api.internal.tasks.SkipTaskExecuter.execute(SkipTaskExecuter.java:36)
> [gradle-src/:na]
> at
> org.gradle.api.internal.AbstractTask.execute(AbstractTask.java:204)
> [gradle-src/:na]
> at
> org.gradle.execution.DefaultTaskGraphExecuter.executeTask(DefaultTaskGraphExecuter.java:167)
> [gradle-src/:na]
> at
> org.gradle.execution.DefaultTaskGraphExecuter.doExecute(DefaultTaskGraphExecuter.java:160)
> [gradle-src/:na]
> at
> org.gradle.execution.DefaultTaskGraphExecuter.execute(DefaultTaskGraphExecuter.java:78)
> [gradle-src/:na]
> at
> org.gradle.execution.TaskNameResolvingBuildExecuter.execute(TaskNameResolvingBuildExecuter.java:160)
> [gradle-src/:na]
> at
> org.gradle.execution.DelegatingBuildExecuter.execute(DelegatingBuildExecuter.java:54)
> [gradle-src/:na]
> at
> org.gradle.GradleLauncher.doBuildStages(GradleLauncher.java:193)
> [gradle-src/:na]
> at org.gradle.GradleLauncher.doBuild(GradleLauncher.java:128)
> [gradle-src/:na]
> at org.gradle.GradleLauncher.run(GradleLauncher.java:98)
> [gradle-src/:na]
> at org.gradle.launcher.Main.execute(Main.java:93)
> [gradle-src/:na]
> at org.gradle.launcher.Main.main(Main.java:42) [gradle-src/:na]
> at sun.reflect.NativeMethodAccessorImpl.invoke0(Native Method)
> [na:1.5.0_10]
> at
> sun.reflect.NativeMethodAccessorImpl.invoke(NativeMethodAccessorImpl.java:39)
> [na:1.5.0_10]
> at
> sun.reflect.DelegatingMethodAccessorImpl.invoke(DelegatingMethodAccessorImpl.java:25)
> [na:1.5.0_10]
> at java.lang.reflect.Method.invoke(Method.java:585)
> [na:1.5.0_10]
> at org.gradle.launcher.GradleMain.main(GradleMain.java:50)
> [gradle-src/:na]
> at sun.reflect.NativeMethodAccessorImpl.invoke0(Native Method)
> [na:1.5.0_10]
> at
> sun.reflect.NativeMethodAccessorImpl.invoke(NativeMethodAccessorImpl.java:39)
> [na:1.5.0_10]
> at
> sun.reflect.DelegatingMethodAccessorImpl.invoke(DelegatingMethodAccessorImpl.java:25)
> [na:1.5.0_10]
> at java.lang.reflect.Method.invoke(Method.java:585)
> [na:1.5.0_10]
> at
> com.intellij.rt.execution.application.AppMain.main(AppMain.java:105)
> [idea_rt.jar:na]
> Caused by:
> org.gradle.cache.BTreePersistentIndexedCache$CorruptedCacheException:
> Corrupted IndexBlock 27518172 found in cache
> '<somePath>\.gradle\0.9-20091126125859+0300\taskArtifacts\cache.bin'.
> at
> org.gradle.cache.BTreePersistentIndexedCache$Block.corruptedException(BTreePersistentIndexedCache.java:389)
> [gradle-src/:na]
> at
> org.gradle.cache.BTreePersistentIndexedCache$Block.read(BTreePersistentIndexedCache.java:365)
> [gradle-src/:na]
> at
> org.gradle.cache.BTreePersistentIndexedCache.load(BTreePersistentIndexedCache.java:207)
> [gradle-src/:na]
> at
> org.gradle.cache.BTreePersistentIndexedCache.access$1800(BTreePersistentIndexedCache.java:42)
> [gradle-src/:na]
> at
> org.gradle.cache.BTreePersistentIndexedCache$IndexRoot.getRoot(BTreePersistentIndexedCache.java:440)
> [gradle-src/:na]
> at
> org.gradle.cache.BTreePersistentIndexedCache$HeaderBlock.getFreeListRoot(BTreePersistentIndexedCache.java:493)
> [gradle-src/:na]
> at
> org.gradle.cache.BTreePersistentIndexedCache.alloc(BTreePersistentIndexedCache.java:177)
> [gradle-src/:na]
> at
> org.gradle.cache.BTreePersistentIndexedCache.access$900(BTreePersistentIndexedCache.java:42)
> [gradle-src/:na]
> at
> org.gradle.cache.BTreePersistentIndexedCache$Block.getPos(BTreePersistentIndexedCache.java:333)
> [gradle-src/:na]
> at
> org.gradle.cache.BTreePersistentIndexedCache$IndexBlock.add(BTreePersistentIndexedCache.java:598)
> [gradle-src/:na]
> at
> org.gradle.cache.BTreePersistentIndexedCache$IndexBlock.maybeSplit(BTreePersistentIndexedCache.java:586)
> [gradle-src/:na]
> at
> org.gradle.cache.BTreePersistentIndexedCache$IndexBlock.put(BTreePersistentIndexedCache.java:569)
> [gradle-src/:na]
> at
> org.gradle.cache.BTreePersistentIndexedCache.free(BTreePersistentIndexedCache.java:173)
> [gradle-src/:na]
> at
> org.gradle.cache.BTreePersistentIndexedCache.free(BTreePersistentIndexedCache.java:165)
> [gradle-src/:na]
> at
> org.gradle.cache.BTreePersistentIndexedCache.put(BTreePersistentIndexedCache.java:131)
> [gradle-src/:na]
> ... 25 common frames omitted
>
> BUILD FAILED
>
> Total time: 1 mins 54.865 secs
>
> Hans
>
> Process finished with exit code 1
>  

--
Adam Murdoch
Gradle Developer
http://www.gradle.org


---------------------------------------------------------------------
To unsubscribe from this list, please visit:

    http://xircles.codehaus.org/manage_email


Loading...