weird gradle issue

classic Classic list List threaded Threaded
2 messages Options
Reply | Threaded
Open this post in threaded view
|

weird gradle issue

Strong Liu
Hi there,

could someone tell me what does this error mean?

I"m runing hibernate testsuite on the so called DB matrix within Jenkins ( a matrix job) and i see a lot of this error in the build history.


FAILURE: Build failed with an exception.

* What went wrong:
Execution failed for task ':hibernate-core:matrix_mssql2008R1'.
> Process 'Gradle Worker 1' finished with non-zero exit value 139

* Try:
Run with --debug option to get more log output.

* Exception is:
org.gradle.api.tasks.TaskExecutionException: Execution failed for task ':hibernate-core:matrix_mssql2008R1'.
	at org.gradle.api.internal.tasks.execution.ExecuteActionsTaskExecuter.executeActions(ExecuteActionsTaskExecuter.java:68)
	at org.gradle.api.internal.tasks.execution.ExecuteActionsTaskExecuter.execute(ExecuteActionsTaskExecuter.java:46)
	at org.gradle.api.internal.tasks.execution.PostExecutionAnalysisTaskExecuter.execute(PostExecutionAnalysisTaskExecuter.java:34)
	at org.gradle.api.internal.changedetection.CacheLockHandlingTaskExecuter$1.run(CacheLockHandlingTaskExecuter.java:34)
	at org.gradle.cache.internal.DefaultCacheAccess$2.create(DefaultCacheAccess.java:200)
	at org.gradle.cache.internal.DefaultCacheAccess.longRunningOperation(DefaultCacheAccess.java:172)
	at org.gradle.cache.internal.DefaultCacheAccess.longRunningOperation(DefaultCacheAccess.java:198)
	at org.gradle.cache.internal.DefaultPersistentDirectoryStore.longRunningOperation(DefaultPersistentDirectoryStore.java:137)
	at org.gradle.api.internal.changedetection.DefaultTaskArtifactStateCacheAccess.longRunningOperation(DefaultTaskArtifactStateCacheAccess.java:83)
	at org.gradle.api.internal.changedetection.CacheLockHandlingTaskExecuter.execute(CacheLockHandlingTaskExecuter.java:32)
	at org.gradle.api.internal.tasks.execution.SkipUpToDateTaskExecuter.execute(SkipUpToDateTaskExecuter.java:55)
	at org.gradle.api.internal.tasks.execution.ValidatingTaskExecuter.execute(ValidatingTaskExecuter.java:57)
	at org.gradle.api.internal.tasks.execution.SkipEmptySourceFilesTaskExecuter.execute(SkipEmptySourceFilesTaskExecuter.java:41)
	at org.gradle.api.internal.tasks.execution.SkipTaskWithNoActionsExecuter.execute(SkipTaskWithNoActionsExecuter.java:51)
	at org.gradle.api.internal.tasks.execution.SkipOnlyIfTaskExecuter.execute(SkipOnlyIfTaskExecuter.java:52)
	at org.gradle.api.internal.tasks.execution.ExecuteAtMostOnceTaskExecuter.execute(ExecuteAtMostOnceTaskExecuter.java:42)
	at org.gradle.api.internal.AbstractTask.executeWithoutThrowingTaskFailure(AbstractTask.java:247)
	at org.gradle.execution.DefaultTaskGraphExecuter.executeTask(DefaultTaskGraphExecuter.java:192)
	at org.gradle.execution.DefaultTaskGraphExecuter.doExecute(DefaultTaskGraphExecuter.java:177)
	at org.gradle.execution.DefaultTaskGraphExecuter.execute(DefaultTaskGraphExecuter.java:83)
	at org.gradle.execution.SelectedTaskExecutionAction.execute(SelectedTaskExecutionAction.java:33)
	at org.gradle.execution.DefaultBuildExecuter.execute(DefaultBuildExecuter.java:61)
	at org.gradle.execution.DefaultBuildExecuter.access$200(DefaultBuildExecuter.java:23)
	at org.gradle.execution.DefaultBuildExecuter$2.proceed(DefaultBuildExecuter.java:67)
	at org.gradle.api.internal.changedetection.TaskCacheLockHandlingBuildExecuter$1.run(TaskCacheLockHandlingBuildExecuter.java:31)
	at org.gradle.cache.internal.DefaultCacheAccess$1.create(DefaultCacheAccess.java:111)
	at org.gradle.cache.internal.DefaultCacheAccess.useCache(DefaultCacheAccess.java:126)
	at org.gradle.cache.internal.DefaultCacheAccess.useCache(DefaultCacheAccess.java:109)
	at org.gradle.cache.internal.DefaultPersistentDirectoryStore.useCache(DefaultPersistentDirectoryStore.java:129)
	at org.gradle.api.internal.changedetection.DefaultTaskArtifactStateCacheAccess.useCache(DefaultTaskArtifactStateCacheAccess.java:79)
	at org.gradle.api.internal.changedetection.TaskCacheLockHandlingBuildExecuter.execute(TaskCacheLockHandlingBuildExecuter.java:29)
	at org.gradle.execution.DefaultBuildExecuter.execute(DefaultBuildExecuter.java:61)
	at org.gradle.execution.DefaultBuildExecuter.access$200(DefaultBuildExecuter.java:23)
	at org.gradle.execution.DefaultBuildExecuter$2.proceed(DefaultBuildExecuter.java:67)
	at org.gradle.execution.DryRunBuildExecutionAction.execute(DryRunBuildExecutionAction.java:32)
	at org.gradle.execution.DefaultBuildExecuter.execute(DefaultBuildExecuter.java:61)
	at org.gradle.execution.DefaultBuildExecuter.execute(DefaultBuildExecuter.java:54)
	at org.gradle.initialization.DefaultGradleLauncher.doBuildStages(DefaultGradleLauncher.java:155)
	at org.gradle.initialization.DefaultGradleLauncher.doBuild(DefaultGradleLauncher.java:110)
	at org.gradle.initialization.DefaultGradleLauncher.run(DefaultGradleLauncher.java:78)
	at org.gradle.launcher.cli.ExecuteBuildAction.run(ExecuteBuildAction.java:38)
	at org.gradle.launcher.exec.InProcessGradleLauncherActionExecuter.execute(InProcessGradleLauncherActionExecuter.java:39)
	at org.gradle.launcher.exec.InProcessGradleLauncherActionExecuter.execute(InProcessGradleLauncherActionExecuter.java:25)
	at org.gradle.launcher.cli.RunBuildAction.run(RunBuildAction.java:50)
	at org.gradle.launcher.cli.ActionAdapter.execute(ActionAdapter.java:30)
	at org.gradle.launcher.cli.ActionAdapter.execute(ActionAdapter.java:22)
	at org.gradle.launcher.cli.CommandLineActionFactory$ParseAndBuildAction.execute(CommandLineActionFactory.java:200)
	at org.gradle.launcher.cli.CommandLineActionFactory$ParseAndBuildAction.execute(CommandLineActionFactory.java:173)
	at org.gradle.launcher.cli.CommandLineActionFactory$WithLogging.execute(CommandLineActionFactory.java:169)
	at org.gradle.launcher.cli.CommandLineActionFactory$WithLogging.execute(CommandLineActionFactory.java:138)
	at org.gradle.launcher.cli.ExceptionReportingAction.execute(ExceptionReportingAction.java:33)
	at org.gradle.launcher.cli.ExceptionReportingAction.execute(ExceptionReportingAction.java:22)
	at org.gradle.launcher.Main.doAction(Main.java:48)
	at org.gradle.launcher.bootstrap.EntryPoint.run(EntryPoint.java:45)
	at org.gradle.launcher.Main.main(Main.java:39)
	at org.gradle.launcher.bootstrap.ProcessBootstrap.runNoExit(ProcessBootstrap.java:50)
	at org.gradle.launcher.bootstrap.ProcessBootstrap.run(ProcessBootstrap.java:32)
	at org.gradle.launcher.GradleMain.main(GradleMain.java:26)
	at org.gradle.wrapper.BootstrapMainStarter.start(BootstrapMainStarter.java:33)
	at org.gradle.wrapper.Wrapper.execute(Wrapper.java:87)
	at org.gradle.wrapper.GradleWrapperMain.main(GradleWrapperMain.java:37)
Caused by: org.gradle.process.internal.ExecException: Process 'Gradle Worker 1' finished with non-zero exit value 139
	at org.gradle.process.internal.DefaultExecHandle$ExecResultImpl.assertNormalExitValue(DefaultExecHandle.java:363)
	at org.gradle.process.internal.DefaultWorkerProcess.waitForStop(DefaultWorkerProcess.java:145)
	at org.gradle.api.internal.tasks.testing.worker.ForkingTestClassProcessor.stop(ForkingTestClassProcessor.java:77)
	at org.gradle.api.internal.tasks.testing.processors.RestartEveryNTestClassProcessor.endBatch(RestartEveryNTestClassProcessor.java:60)
	at org.gradle.api.internal.tasks.testing.processors.RestartEveryNTestClassProcessor.stop(RestartEveryNTestClassProcessor.java:54)
	at org.gradle.messaging.dispatch.ReflectionDispatch.dispatch(ReflectionDispatch.java:35)
	at org.gradle.messaging.dispatch.ReflectionDispatch.dispatch(ReflectionDispatch.java:24)
	at org.gradle.messaging.dispatch.FailureHandlingDispatch.dispatch(FailureHandlingDispatch.java:29)
	at org.gradle.messaging.dispatch.AsyncDispatch.dispatchMessages(AsyncDispatch.java:132)
	at org.gradle.messaging.dispatch.AsyncDispatch.access$000(AsyncDispatch.java:33)
	at org.gradle.messaging.dispatch.AsyncDispatch$1.run(AsyncDispatch.java:72)
	at org.gradle.internal.concurrent.DefaultExecutorFactory$StoppableExecutorImpl$1.run(DefaultExecutorFactory.java:66)

-------------------------
Best Regards,

Strong Liu <stliu at hibernate.org>

Reply | Threaded
Open this post in threaded view
|

Re: weird gradle issue

Luke Daley-2

On 08/08/2012, at 2:44 PM, Strong Liu wrote:

> Hi there,
>
> could someone tell me what does this error mean?

It means that the forked test execution process crashed. That exit code means that most likely it was a segmentation violation (SIGSEGV) in user space.

Is this happening consistently? What OS? What JVM?

>
> I"m runing hibernate testsuite on the so called DB matrix within Jenkins ( a matrix job) and i see a lot of this error in the build history.
>
>
> FAILURE: Build failed with an exception.
>
> * What went wrong:
> Execution failed for task ':hibernate-core:matrix_mssql2008R1'.
> > Process 'Gradle Worker 1' finished with non-zero exit value 139
>
> * Try:
> Run with --debug option to get more log output.
>
> * Exception is:
> org.gradle.api.tasks.TaskExecutionException: Execution failed for task ':hibernate-core:matrix_mssql2008R1'.
> at org.gradle.api.internal.tasks.execution.ExecuteActionsTaskExecuter.executeActions(ExecuteActionsTaskExecuter.java:68)
> at org.gradle.api.internal.tasks.execution.ExecuteActionsTaskExecuter.execute(ExecuteActionsTaskExecuter.java:46)
> at org.gradle.api.internal.tasks.execution.PostExecutionAnalysisTaskExecuter.execute(PostExecutionAnalysisTaskExecuter.java:34)
> at org.gradle.api.internal.changedetection.CacheLockHandlingTaskExecuter$1.run(CacheLockHandlingTaskExecuter.java:34)
> at org.gradle.cache.internal.DefaultCacheAccess$2.create(DefaultCacheAccess.java:200)
> at org.gradle.cache.internal.DefaultCacheAccess.longRunningOperation(DefaultCacheAccess.java:172)
> at org.gradle.cache.internal.DefaultCacheAccess.longRunningOperation(DefaultCacheAccess.java:198)
> at org.gradle.cache.internal.DefaultPersistentDirectoryStore.longRunningOperation(DefaultPersistentDirectoryStore.java:137)
> at org.gradle.api.internal.changedetection.DefaultTaskArtifactStateCacheAccess.longRunningOperation(DefaultTaskArtifactStateCacheAccess.java:83)
> at org.gradle.api.internal.changedetection.CacheLockHandlingTaskExecuter.execute(CacheLockHandlingTaskExecuter.java:32)
> at org.gradle.api.internal.tasks.execution.SkipUpToDateTaskExecuter.execute(SkipUpToDateTaskExecuter.java:55)
> at org.gradle.api.internal.tasks.execution.ValidatingTaskExecuter.execute(ValidatingTaskExecuter.java:57)
> at org.gradle.api.internal.tasks.execution.SkipEmptySourceFilesTaskExecuter.execute(SkipEmptySourceFilesTaskExecuter.java:41)
> at org.gradle.api.internal.tasks.execution.SkipTaskWithNoActionsExecuter.execute(SkipTaskWithNoActionsExecuter.java:51)
> at org.gradle.api.internal.tasks.execution.SkipOnlyIfTaskExecuter.execute(SkipOnlyIfTaskExecuter.java:52)
> at org.gradle.api.internal.tasks.execution.ExecuteAtMostOnceTaskExecuter.execute(ExecuteAtMostOnceTaskExecuter.java:42)
> at org.gradle.api.internal.AbstractTask.executeWithoutThrowingTaskFailure(AbstractTask.java:247)
> at org.gradle.execution.DefaultTaskGraphExecuter.executeTask(DefaultTaskGraphExecuter.java:192)
> at org.gradle.execution.DefaultTaskGraphExecuter.doExecute(DefaultTaskGraphExecuter.java:177)
> at org.gradle.execution.DefaultTaskGraphExecuter.execute(DefaultTaskGraphExecuter.java:83)
> at org.gradle.execution.SelectedTaskExecutionAction.execute(SelectedTaskExecutionAction.java:33)
> at org.gradle.execution.DefaultBuildExecuter.execute(DefaultBuildExecuter.java:61)
> at org.gradle.execution.DefaultBuildExecuter.access$200(DefaultBuildExecuter.java:23)
> at org.gradle.execution.DefaultBuildExecuter$2.proceed(DefaultBuildExecuter.java:67)
> at org.gradle.api.internal.changedetection.TaskCacheLockHandlingBuildExecuter$1.run(TaskCacheLockHandlingBuildExecuter.java:31)
> at org.gradle.cache.internal.DefaultCacheAccess$1.create(DefaultCacheAccess.java:111)
> at org.gradle.cache.internal.DefaultCacheAccess.useCache(DefaultCacheAccess.java:126)
> at org.gradle.cache.internal.DefaultCacheAccess.useCache(DefaultCacheAccess.java:109)
> at org.gradle.cache.internal.DefaultPersistentDirectoryStore.useCache(DefaultPersistentDirectoryStore.java:129)
> at org.gradle.api.internal.changedetection.DefaultTaskArtifactStateCacheAccess.useCache(DefaultTaskArtifactStateCacheAccess.java:79)
> at org.gradle.api.internal.changedetection.TaskCacheLockHandlingBuildExecuter.execute(TaskCacheLockHandlingBuildExecuter.java:29)
> at org.gradle.execution.DefaultBuildExecuter.execute(DefaultBuildExecuter.java:61)
> at org.gradle.execution.DefaultBuildExecuter.access$200(DefaultBuildExecuter.java:23)
> at org.gradle.execution.DefaultBuildExecuter$2.proceed(DefaultBuildExecuter.java:67)
> at org.gradle.execution.DryRunBuildExecutionAction.execute(DryRunBuildExecutionAction.java:32)
> at org.gradle.execution.DefaultBuildExecuter.execute(DefaultBuildExecuter.java:61)
> at org.gradle.execution.DefaultBuildExecuter.execute(DefaultBuildExecuter.java:54)
> at org.gradle.initialization.DefaultGradleLauncher.doBuildStages(DefaultGradleLauncher.java:155)
> at org.gradle.initialization.DefaultGradleLauncher.doBuild(DefaultGradleLauncher.java:110)
> at org.gradle.initialization.DefaultGradleLauncher.run(DefaultGradleLauncher.java:78)
> at org.gradle.launcher.cli.ExecuteBuildAction.run(ExecuteBuildAction.java:38)
> at org.gradle.launcher.exec.InProcessGradleLauncherActionExecuter.execute(InProcessGradleLauncherActionExecuter.java:39)
> at org.gradle.launcher.exec.InProcessGradleLauncherActionExecuter.execute(InProcessGradleLauncherActionExecuter.java:25)
> at org.gradle.launcher.cli.RunBuildAction.run(RunBuildAction.java:50)
> at org.gradle.launcher.cli.ActionAdapter.execute(ActionAdapter.java:30)
> at org.gradle.launcher.cli.ActionAdapter.execute(ActionAdapter.java:22)
> at org.gradle.launcher.cli.CommandLineActionFactory$ParseAndBuildAction.execute(CommandLineActionFactory.java:200)
> at org.gradle.launcher.cli.CommandLineActionFactory$ParseAndBuildAction.execute(CommandLineActionFactory.java:173)
> at org.gradle.launcher.cli.CommandLineActionFactory$WithLogging.execute(CommandLineActionFactory.java:169)
> at org.gradle.launcher.cli.CommandLineActionFactory$WithLogging.execute(CommandLineActionFactory.java:138)
> at org.gradle.launcher.cli.ExceptionReportingAction.execute(ExceptionReportingAction.java:33)
> at org.gradle.launcher.cli.ExceptionReportingAction.execute(ExceptionReportingAction.java:22)
> at org.gradle.launcher.Main.doAction(Main.java:48)
> at org.gradle.launcher.bootstrap.EntryPoint.run(EntryPoint.java:45)
> at org.gradle.launcher.Main.main(Main.java:39)
> at org.gradle.launcher.bootstrap.ProcessBootstrap.runNoExit(ProcessBootstrap.java:50)
> at org.gradle.launcher.bootstrap.ProcessBootstrap.run(ProcessBootstrap.java:32)
> at org.gradle.launcher.GradleMain.main(GradleMain.java:26)
> at org.gradle.wrapper.BootstrapMainStarter.start(BootstrapMainStarter.java:33)
> at org.gradle.wrapper.Wrapper.execute(Wrapper.java:87)
> at org.gradle.wrapper.GradleWrapperMain.main(GradleWrapperMain.java:37)
> Caused by: org.gradle.process.internal.ExecException: Process 'Gradle Worker 1' finished with non-zero exit value 139
> at org.gradle.process.internal.DefaultExecHandle$ExecResultImpl.assertNormalExitValue(DefaultExecHandle.java:363)
> at org.gradle.process.internal.DefaultWorkerProcess.waitForStop(DefaultWorkerProcess.java:145)
> at org.gradle.api.internal.tasks.testing.worker.ForkingTestClassProcessor.stop(ForkingTestClassProcessor.java:77)
> at org.gradle.api.internal.tasks.testing.processors.RestartEveryNTestClassProcessor.endBatch(RestartEveryNTestClassProcessor.java:60)
> at org.gradle.api.internal.tasks.testing.processors.RestartEveryNTestClassProcessor.stop(RestartEveryNTestClassProcessor.java:54)
> at org.gradle.messaging.dispatch.ReflectionDispatch.dispatch(ReflectionDispatch.java:35)
> at org.gradle.messaging.dispatch.ReflectionDispatch.dispatch(ReflectionDispatch.java:24)
> at org.gradle.messaging.dispatch.FailureHandlingDispatch.dispatch(FailureHandlingDispatch.java:29)
> at org.gradle.messaging.dispatch.AsyncDispatch.dispatchMessages(AsyncDispatch.java:132)
> at org.gradle.messaging.dispatch.AsyncDispatch.access$000(AsyncDispatch.java:33)
> at org.gradle.messaging.dispatch.AsyncDispatch$1.run(AsyncDispatch.java:72)
> at org.gradle.internal.concurrent.DefaultExecutorFactory$StoppableExecutorImpl$1.run(DefaultExecutorFactory.java:66)

--
Luke Daley
Principal Engineer, Gradleware
http://gradleware.com


---------------------------------------------------------------------
To unsubscribe from this list, please visit:

    http://xircles.codehaus.org/manage_email